Study_site,Study_ID,Q1_1,Q1_2,Q1_3,Q1_4,Q1_4_number_children,Q1_5,Q1_6,Q1_7,Q1_8,Q1_9,Q1_10,Q1_11,Q1_12,Q1_13,Q1_13A,Q1_14A,Q1_14B,Q1_14C,Q1_14D,Q1_14E,Q1_14F,Q1_14G,Q2_1_1,Q2_1_2,Q2_1_3,Q2_1_4,Q2_1_5,Q2_1_6,Q2_1_7,Q2_1_8,Q2_1_9,Q2_1_10,Q2_1_11,Q2_1_12,Q2_1_13,Q2_1_14,Q2_1_15,Q2_1_16,Q2_1_17,Q2_1_18,Q2_1_19,Q2_1_20,Q2_1_21,Q2_1_22,Q2_1_23,Q2_1_24,Q2_1_25other,Q2_1_26other,Q2_1_27other,Q2_1_28other,Q2_1_29other,Q2_1_30other,Q2_4A,Q2_4B,Q2_4C,Q3_1A,Q3_1B,Q3_1C,Q3_1D,Q3_1E,Q3_1F,Q3_1G,Q3_1H,Q3_1I,Q3_2A,Q3_2B,Q3_2C,Q3_2D,Q3_2E,Q3_2F,Q3_2G,Q3_3A,Q3_3B,Q3_3C,Q3_3D,Q3_3E,Q3_3F,Q3_3G,Q3_3H,Q3_4,Q3_5A,Q3_5B,Q3_6A,Q3_6B,Q3_6C,Q3_6D,Q3_6E,Q3_6F,Q3_7A,Q3_7B,Q3_7C,Q3_7D,Q3_7E,Q3_7F,Q3_7G,Q3_7H,Q4_1_1,Q4_1_2,Q4_1_3,Q4_1_4,Q4_1_5,Q4_1_6,Q4_1_7,Q4_1_8,Q4_1_9,Q4_1_10,Q4_1_11,Q4_1_12,Q4_2A,Q4_2B,Q4_2C,Q4_2D,Q4_4,Q4_5A,Q4_5B,Q4_5C,Q4_5D,Q4_5E,Q4_5F,Q4_5G,Q4_5H,Q4_5I,Q4_6A,Q4_6B,Q4_6C,Q4_6D,Q4_6E,Q4_6F,Q4_6G,Q4_6H,Q4_6I,Q4_7A,Q4_7B,Q4_7C,Q4_7D,Q4_8A,Q4_8B,Q4_8C,Q4_8D,Q4_8E,Q4_8F,Q4_8G,Q4_8H,Q5_1A,Q5_1B,Q5_2A,Q5_2B,Q5_2C,Q5_2D,Q5_3,Q5_4,Q5_5,Q5_6,Q5_7A,Q5_7B,C_1,C_1_nomissing,C_2,C_2_nomissing,C_3,C_3_nomissing,C_4,C_4_nomissing,C_5,C_5_nomissing,C_6,C_6_nomissing,C_7,C_7_nomissing,sum,Q3_2A_scale,Q3_2B_scale,Q3_2C_scale,Q3_2D_scale,Q3_2E_scale,Q3_2F_scale,Q3_2G_scale,Q4_5A_N2,Q4_5B_N2,Q4_5C_N2,Q4_5D_N2,Q4_5E_N2,Q4_5F_N2,Q4_5G_N2,Q4_5H_N2,Q4_5I_N2,C1_N4_combine45,C2_YN,C3_YN,C4_YN,C5_YN,C6_N5,C7_YN,Q4_2C_N2,Q4_2D_N2,Q4_8A_scale,Q4_8B_scale,Q4_8C_scale,Q4_8D_scale,Q4_8E_scale,Q4_8F_scale,Q4_8G_scale,Q4_8H_scale,Q1_13_YN,Q1_13A_YN,Level_discrimination_experience,Self_stigma,Affiliate_stigma,Resilence,Social_support,Loss_of_resources,Impact_of_COVID,physicalstatus,exposuresuffering,exposuredeath,PHQ_9,GAD_7,PTSD,PTG,Q3_6DR,SAD,exposure,prob_depression,prob_anxiety,age,age_group,Married,edu_level,filter_$,residents_city,income_level,employment,family_mem_infected,family_mem_die,Clinical_cla,ICU_admin,ventilation,corticosteroid,complications,Sequelae,dis_chro,nucleic_positive,mental_heal_discharge,mental_heal_hospital,somatization_cat,having_children
1.0,23.0,1989.0,1.0,2.0,1.0,2.0,2.0,1.0,3.0,-9.0,4.0,1.0,1.0,5.0,2.0,2.0,1.0,1.0,1.0,1.0,2.0,1.0,1.0,1.0,1.0,1.0,1.0,1.0,1.0,1.0,1.0,0.0,0.0,1.0,1.0,1.0,0.0,1.0,0.0,0.0,0.0,0.0,0.0,0.0,0.0,1.0,0.0,无,,,,,,1.0,1.0,1.0,1.0,1.0,0.0,1.0,1.0,0.0,0.0,1.0,0.0,1.0,1.0,1.0,1.0,2.0,1.0,1.0,2.0,1.0,1.0,1.0,1.0,1.0,1.0,1.0,8.0,4.0,3.0,1.0,2.0,2.0,4.0,2.0,2.0,0.0,0.0,0.0,0.0,0.0,0.0,0.0,0.0,,,,,,,,,,,,肾结石史,2.0,2.0,1.0,1.0,2.0,2.0,2.0,2.0,2.0,2.0,1.0,1.0,2.0,2.0,2.0,3.0,2.0,2.0,2.0,2.0,2.0,2.0,2.0,8.0,8.0,7.0,5.1,2.0,2.0,2.0,2.0,2.0,2.0,2.0,2.0,2.0,1.0,4.0,4.0,3.0,4.0,1.0,1.0,4.0,1.0,2.0,1.0,-,-9.0,-,,-,,-,,-,,-,-9.0,-,,,0.0,0.0,0.0,0.0,1.0,0.0,0.0,0.0,0.0,0.0,0.0,0.0,1.0,1.0,0.0,0.0,5.0,0.0,0.0,0.0,0.0,5.0,0.0,1.0,1.0,0.0,0.0,0.0,0.0,0.0,0.0,0.0,0.0,0.0,0.0,2.0,19.0,8.0,7.0,28.1,0.0,3.0,13.0,0.0,0.0,5.0,1.0,9.0,0.0,2.0,11.0,0.0,1.0,0.0,31.0,2.0,2.0,1.0,1.0,0.0,1.0,1.0,0.0,0.0,5.0,0.0,0.0,0.0,0.0,0.0,1.0,0.0,1.0,1.0,2.0,1.0
3.0,2050.0,1982.0,1.0,2.0,2.0,0.0,,2.0,1.0,-9.0,4.0,1.0,1.0,3.0,2.0,2.0,1.0,1.0,1.0,1.0,1.0,1.0,1.0,0.0,0.0,0.0,0.0,0.0,0.0,0.0,0.0,0.0,0.0,0.0,0.0,0.0,0.0,0.0,0.0,0.0,0.0,0.0,0.0,0.0,0.0,0.0,0.0,无,,,,,,0.0,0.0,0.0,0.0,0.0,0.0,0.0,0.0,0.0,0.0,0.0,0.0,1.0,1.0,1.0,1.0,1.0,1.0,1.0,1.0,1.0,1.0,1.0,1.0,1.0,1.0,1.0,10.0,4.0,4.0,1.0,1.0,1.0,5.0,1.0,1.0,2.0,0.0,0.0,0.0,0.0,0.0,0.0,0.0,,,,,,,,,,,,0,2.0,2.0,1.0,1.0,2.0,2.0,2.0,2.0,2.0,2.0,2.0,1.0,2.0,2.0,1.0,1.0,1.0,1.0,1.0,1.0,2.0,1.0,1.0,10.0,10.0,10.0,10.0,2.0,2.0,2.0,2.0,2.0,2.0,2.0,2.0,1.0,1.0,5.0,1.0,4.0,3.0,1.0,2.0,1.0,1.0,2.0,2.0,2,2.0,2,2.0,2,2.0,2,2.0,2,2.0,14,14.0,2,2.0,,0.0,0.0,0.0,0.0,0.0,0.0,0.0,0.0,0.0,0.0,0.0,0.0,0.0,1.0,0.0,0.0,2.0,0.0,0.0,0.0,0.0,1.0,0.0,1.0,1.0,0.0,0.0,0.0,0.0,0.0,0.0,0.0,0.0,0.0,0.0,1.0,10.0,7.0,8.0,40.0,0.0,0.0,0.0,0.0,0.0,0.0,0.0,8.0,2.0,1.0,6.0,0.0,0.0,0.0,38.0,2.0,2.0,4.0,1.0,1.0,1.0,1.0,0.0,0.0,2.0,0.0,0.0,0.0,0.0,0.0,0.0,0.0,1.0,1.0,0.0,0.0
3.0,2081.0,1988.0,1.0,1.0,2.0,0.0,6.0,2.0,4.0,-9.0,4.0,1.0,1.0,1.0,2.0,2.0,1.0,1.0,1.0,1.0,1.0,1.0,1.0,0.0,0.0,0.0,0.0,0.0,0.0,0.0,0.0,0.0,0.0,0.0,0.0,0.0,0.0,0.0,0.0,0.0,0.0,0.0,0.0,0.0,0.0,0.0,0.0,无,,,,,,1.0,1.0,1.0,0.0,0.0,0.0,0.0,0.0,0.0,0.0,0.0,0.0,1.0,1.0,1.0,1.0,1.0,1.0,1.0,1.0,1.0,1.0,1.0,1.0,1.0,1.0,1.0,5.0,1.0,1.0,1.0,1.0,1.0,5.0,1.0,1.0,0.0,0.0,0.0,0.0,0.0,0.0,0.0,0.0,,,,,,,,,,,,0,2.0,2.0,2.0,2.0,2.0,2.0,2.0,2.0,2.0,2.0,2.0,2.0,2.0,2.0,1.0,1.0,1.0,1.0,1.0,1.0,1.0,1.0,1.0,8.0,0.0,8.0,0.0,2.0,2.0,2.0,2.0,2.0,2.0,2.0,2.0,1.0,1.0,5.0,3.0,3.0,5.0,1.0,1.0,2.0,3.0,2.0,2.0,3,3.0,2,2.0,2,2.0,2,2.0,2,2.0,2020.3.24-2020.4.7 14,14.0,2,2.0,,0.0,0.0,0.0,0.0,0.0,0.0,0.0,0.0,0.0,0.0,0.0,0.0,0.0,0.0,0.0,0.0,3.0,0.0,0.0,0.0,0.0,1.0,0.0,0.0,0.0,0.0,0.0,0.0,0.0,0.0,0.0,0.0,0.0,0.0,0.0,0.0,9.0,7.0,2.0,16.0,0.0,3.0,0.0,0.0,0.0,0.0,0.0,8.0,0.0,1.0,6.0,0.0,0.0,0.0,32.0,2.0,1.0,3.0,1.0,0.0,1.0,1.0,0.0,0.0,3.0,0.0,0.0,0.0,0.0,0.0,0.0,0.0,0.0,0.0,0.0,0.0
2.0,2.0,1955.0,1.0,2.0,1.0,1.0,,2.0,3.0,-9.0,9.0,1.0,1.0,1.0,1.0,2.0,1.64,1.99,1.82,1.96,2.15,2.13,2.1,0.0,0.0,0.0,0.0,0.0,0.0,0.0,0.0,0.0,0.0,0.0,0.0,0.0,0.0,0.0,0.0,0.0,0.0,0.0,0.0,0.0,0.0,0.0,0.0,无,,,,,,6.0,6.0,6.0,0.0,0.0,0.0,0.0,0.0,0.0,0.0,0.0,0.0,1.0,1.0,1.0,1.0,1.0,1.0,1.0,1.0,1.0,1.0,2.0,2.0,2.0,1.0,1.0,8.0,5.0,5.0,1.0,1.0,1.0,1.0,1.0,1.0,0.0,0.0,0.0,0.0,0.0,1.0,0.0,0.0,,,,,,,,,,,,0,2.0,2.0,2.0,2.0,2.0,3.0,3.0,3.0,2.0,1.0,1.0,2.0,2.0,2.0,1.0,1.0,1.0,1.0,1.0,1.0,1.0,1.0,1.0,8.46,8.02,6.47,5.1,2.0,2.0,2.0,2.0,2.0,2.0,1.0,2.0,1.0,3.0,3.0,3.0,3.0,3.0,1.0,5.0,4.0,1.0,3.0,3.0,4,4.0,2,2.0,2,2.0,2,2.0,2,2.0,28,28.0,2,2.0,,0.0,0.0,0.0,0.0,0.0,0.0,0.0,0.0,0.0,0.0,0.0,1.0,1.0,0.0,0.0,0.0,4.0,0.0,0.0,0.0,0.0,2.0,0.0,0.0,0.0,0.0,0.0,0.0,0.0,0.0,0.0,-1.0,0.0,-1.0,0.0,2.0,9.0,13.790000000000001,10.0,28.049999999999997,-1.0,18.0,0.0,0.0,0.0,0.0,0.0,11.0,1.0,5.0,10.0,0.0,0.0,0.0,65.0,5.0,2.0,4.0,1.0,0.0,1.0,5.0,1.0,0.0,4.0,0.0,0.0,0.0,0.0,0.0,0.0,0.0,0.0,0.0,0.0,1.0
2.0,37.0,1987.0,1.0,2.0,2.0,0.0,6.0,2.0,1.0,-9.0,4.0,1.0,1.0,1.0,1.0,2.0,1.64,1.99,1.82,1.96,2.15,2.13,2.1,0.0,0.0,0.0,0.0,0.0,0.0,0.0,0.0,0.0,0.0,0.0,0.0,0.0,0.0,0.0,0.0,0.0,0.0,0.0,0.0,0.0,0.0,0.0,0.0,无,,,,,,0.0,0.0,0.0,0.0,0.0,0.0,0.0,0.0,0.0,0.0,0.0,0.0,1.0,1.0,1.0,1.0,1.0,1.0,1.0,1.0,1.0,1.0,1.0,1.0,1.0,1.0,1.0,9.0,4.0,4.0,1.0,1.0,1.0,5.0,1.0,1.0,0.0,0.0,1.0,2.0,1.0,0.0,0.0,0.0,,,,,,,,,,,,0,2.0,2.0,2.0,2.0,2.0,2.0,2.0,2.0,2.0,2.0,2.0,2.0,2.0,2.0,2.0,3.0,1.0,1.0,3.0,1.0,3.0,1.0,1.0,9.0,9.0,9.0,9.0,2.0,2.0,2.0,2.0,2.0,2.0,2.0,2.0,1.0,1.0,4.0,3.0,4.0,4.0,1.0,1.0,1.0,3.0,2.0,2.0,3,3.0,2,2.0,2,2.0,2,2.0,2,2.0,34,34.0,2,2.0,,0.0,0.0,0.0,0.0,0.0,0.0,0.0,0.0,0.0,0.0,0.0,0.0,0.0,0.0,0.0,0.0,3.0,0.0,0.0,0.0,0.0,3.0,0.0,0.0,0.0,0.0,0.0,0.0,0.0,0.0,0.0,0.0,0.0,-1.0,0.0,0.0,16.0,13.790000000000001,8.0,36.0,0.0,0.0,0.0,0.0,0.0,0.0,0.0,8.0,4.0,1.0,6.0,0.0,0.0,0.0,33.0,2.0,2.0,3.0,1.0,1.0,1.0,1.0,1.0,0.0,3.0,0.0,0.0,0.0,0.0,0.0,0.0,0.0,0.0,0.0,0.0,0.0
2.0,40.0,1990.0,2.0,1.0,2.0,0.0,5.0,2.0,1.0,-9.0,4.0,1.0,1.0,1.0,2.0,2.0,1.0,1.0,1.0,1.0,1.0,1.0,1.0,0.0,0.0,0.0,0.0,0.0,0.0,0.0,0.0,0.0,0.0,0.0,0.0,0.0,0.0,0.0,0.0,0.0,0.0,0.0,0.0,0.0,0.0,0.0,0.0,无,,,,,,0.0,0.0,0.0,0.0,0.0,0.0,0.0,0.0,0.0,0.0,0.0,0.0,1.0,1.0,1.0,1.0,1.0,1.0,1.0,1.0,1.0,1.0,1.0,1.0,1.0,1.0,1.0,7.0,4.0,4.0,1.0,1.0,1.0,4.0,1.0,1.0,0.0,0.0,1.0,1.0,1.0,0.0,0.0,0.0,,,,,,,,,,,,0,2.0,2.0,2.0,2.0,2.0,2.0,2.0,2.0,2.0,2.0,2.0,2.0,2.0,2.0,2.0,1.0,1.0,1.0,1.0,1.0,1.0,1.0,1.0,9.0,9.0,8.0,8.0,2.0,2.0,2.0,2.0,2.0,2.0,2.0,2.0,1.0,1.0,4.0,3.0,2.0,4.0,1.0,1.0,3.0,2.0,2.0,2.0,2,2.0,2,2.0,2,2.0,2,2.0,2,2.0,34,34.0,2,2.0,,0.0,0.0,0.0,0.0,0.0,0.0,0.0,0.0,0.0,0.0,0.0,0.0,0.0,0.0,0.0,0.0,2.0,0.0,0.0,0.0,0.0,3.0,0.0,0.0,0.0,0.0,0.0,0.0,0.0,0.0,0.0,0.0,0.0,0.0,0.0,0.0,10.0,7.0,8.0,34.0,0.0,0.0,0.0,0.0,0.0,0.0,0.0,8.0,3.0,2.0,7.0,0.0,0.0,0.0,30.0,1.0,1.0,3.0,1.0,1.0,1.0,1.0,0.0,0.0,2.0,0.0,0.0,0.0,0.0,0.0,0.0,0.0,0.0,0.0,0.0,0.0
1.0,25.0,1972.0,2.0,2.0,1.0,2.0,2.0,1.0,1.0,14.0,9.0,1.0,1.0,1.0,2.0,2.0,1.0,3.0,1.0,2.0,4.0,2.0,2.0,0.0,0.0,0.0,0.0,0.0,0.0,1.0,0.0,1.0,0.0,0.0,0.0,1.0,0.0,0.0,0.0,0.0,0.0,0.0,0.0,0.0,0.0,0.0,0.0,无,,,,,,0.0,0.0,10.0,0.0,1.0,0.0,0.0,0.0,1.0,0.0,0.0,0.0,1.0,1.0,1.0,1.0,1.0,1.0,1.0,1.0,3.0,1.0,1.0,1.0,1.0,1.0,1.0,10.0,3.0,5.0,1.0,3.0,1.0,4.0,2.0,2.0,0.0,0.0,0.0,0.0,0.0,0.0,0.0,0.0,,,,,,,,,,,,0,1.0,3.0,2.0,2.0,2.0,2.0,2.0,2.0,2.0,1.0,1.0,1.0,2.0,1.0,3.0,2.0,2.0,2.0,1.0,2.0,4.0,1.0,3.0,10.0,10.0,0.0,0.0,4.0,2.0,1.0,1.0,2.0,2.0,1.0,2.0,2.0,1.0,4.0,1.0,5.0,4.0,3.0,5.0,4.0,1.0,2.0,3.0,-,-9.0,-,,-,,-,,-,,-,-9.0,-,,,0.0,0.0,0.0,0.0,0.0,0.0,0.0,0.0,0.0,0.0,0.0,1.0,1.0,1.0,0.0,1.0,5.0,0.0,0.0,0.0,0.0,5.0,0.0,0.0,0.0,0.0,0.0,-1.0,-1.0,0.0,0.0,-1.0,0.0,0.0,0.0,4.0,20.0,15.0,8.0,20.0,-3.0,10.0,3.0,1.0,0.0,2.0,0.0,10.0,0.0,2.0,11.0,1.0,0.0,0.0,48.0,3.0,2.0,1.0,1.0,1.0,1.0,5.0,0.0,0.0,5.0,0.0,0.0,0.0,0.0,0.0,0.0,0.0,0.0,0.0,0.0,1.0
3.0,2012.0,2000.0,1.0,1.0,2.0,0.0,3.0,2.0,3.0,14.0,5.0,1.0,1.0,1.0,2.0,2.0,1.0,1.0,1.0,1.0,1.0,1.0,3.0,0.0,0.0,0.0,0.0,0.0,1.0,0.0,0.0,0.0,0.0,0.0,0.0,0.0,0.0,0.0,0.0,0.0,0.0,0.0,0.0,0.0,0.0,0.0,0.0,无,,,,,,1.0,0.0,0.0,0.0,0.0,0.0,0.0,0.0,0.0,0.0,0.0,0.0,1.0,1.0,1.0,1.0,1.0,1.0,1.0,1.0,1.0,1.0,1.0,1.0,1.0,1.0,1.0,8.0,4.0,4.0,1.0,1.0,1.0,1.0,5.0,1.0,3.0,1.0,1.0,1.0,1.0,0.0,0.0,0.0,,,,,,,,,,,,0,1.0,2.0,1.0,1.0,2.0,2.0,2.0,2.0,2.0,2.0,2.0,1.0,2.0,2.0,1.0,1.0,1.0,1.0,1.0,1.0,1.0,1.0,1.0,8.0,10.0,8.0,8.0,2.0,2.0,2.0,2.0,2.0,2.0,2.0,2.0,1.0,1.0,5.0,2.0,4.0,5.0,1.0,5.0,2.0,1.0,2.0,2.0,3,3.0,-,,-,,-,,-,,-,-9.0,-,,,0.0,0.0,0.0,0.0,0.0,0.0,0.0,0.0,0.0,0.0,0.0,0.0,0.0,1.0,0.0,0.0,3.0,0.0,0.0,0.0,0.0,5.0,0.0,1.0,1.0,0.0,0.0,0.0,0.0,0.0,0.0,0.0,0.0,0.0,0.0,1.0,9.0,9.0,8.0,34.0,0.0,1.0,1.0,1.0,0.0,0.0,0.0,8.0,7.0,5.0,14.0,1.0,0.0,0.0,20.0,1.0,1.0,2.0,1.0,0.0,1.0,3.0,0.0,0.0,3.0,0.0,0.0,0.0,0.0,0.0,0.0,0.0,1.0,1.0,0.0,0.0
3.0,2017.0,1981.0,1.0,2.0,1.0,1.0,5.0,2.0,3.0,14.0,7.0,1.0,1.0,1.0,1.0,2.0,1.64,1.99,1.82,1.96,2.15,2.13,2.1,0.0,0.0,0.0,2.0,2.0,0.0,2.0,1.0,0.0,0.0,0.0,0.0,2.0,1.0,0.0,1.0,0.0,1.0,1.0,1.0,0.0,0.0,2.0,1.0,无,,,,,,7.0,7.0,7.0,1.0,1.0,1.0,3.0,3.0,0.0,2.0,2.0,0.0,1.0,2.0,2.0,3.0,3.0,2.0,1.0,4.0,1.0,1.0,1.0,1.0,1.0,2.0,2.0,4.0,5.0,5.0,5.0,1.0,4.0,4.0,1.0,1.0,3.0,0.0,3.0,0.0,3.0,3.0,0.0,0.0,,,,,,,,,,,,0,1.0,1.0,2.0,2.0,2.0,2.0,2.0,2.0,2.0,2.0,1.0,1.0,2.0,2.0,1.0,4.0,4.0,4.0,4.0,2.0,4.0,4.0,3.0,8.0,6.0,6.0,6.0,1.0,1.0,1.0,1.0,1.0,2.0,2.0,1.0,1.0,3.0,1.0,2.0,4.0,5.0,1.0,3.0,2.0,1.0,2.0,2.0,-,-9.0,2,2.0,2,2.0,2,2.0,2,2.0,-,-9.0,2,2.0,,0.0,1.0,1.0,2.0,2.0,1.0,0.0,0.0,0.0,0.0,0.0,0.0,1.0,1.0,0.0,0.0,5.0,0.0,0.0,0.0,0.0,5.0,0.0,0.0,0.0,-1.0,-1.0,-1.0,-1.0,-1.0,0.0,0.0,-1.0,-1.0,0.0,2.0,30.0,13.790000000000001,10.0,26.0,-6.0,21.0,17.0,1.0,1.0,13.0,7.0,13.0,12.0,2.0,14.0,2.0,1.0,1.0,39.0,2.0,2.0,3.0,1.0,0.0,1.0,2.0,1.0,0.0,5.0,0.0,0.0,0.0,0.0,0.0,0.0,0.0,0.0,0.0,3.0,1.0
5.0,5059.0,1962.0,1.0,2.0,1.0,1.0,3.0,2.0,3.0,14.0,9.0,1.0,1.0,1.0,2.0,2.0,3.0,3.0,3.0,3.0,3.0,3.0,3.0,0.0,0.0,0.0,0.0,0.0,0.0,1.0,0.0,0.0,0.0,0.0,0.0,2.0,1.0,0.0,0.0,0.0,0.0,0.0,0.0,0.0,0.0,2.0,0.0,感冒：2次,掉头发：经常,,,,,8.0,8.0,8.0,1.0,1.0,3.0,3.0,0.0,1.0,0.0,1.0,0.0,2.0,2.0,2.0,2.0,2.0,2.0,2.0,2.0,2.0,5.0,4.0,2.0,2.0,3.0,3.0,3.0,2.0,2.0,3.0,2.0,2.0,3.0,2.0,2.0,0.0,0.0,0.0,0.0,1.0,0.0,0.0,0.0,,,,,,,,,,,,0,1.0,1.0,2.0,2.0,2.0,2.0,2.0,2.0,1.0,1.0,1.0,2.0,2.0,2.0,3.0,4.0,3.0,3.0,4.0,3.0,2.0,3.0,4.0,5.0,5.0,5.0,5.0,2.0,2.0,1.0,1.0,1.0,1.0,1.0,2.0,2.0,2.0,2.0,2.0,2.0,2.0,1.0,5.0,1.0,3.0,1.0,1.0,4,4.0,2,2.0,1,1.0,1,1.0,2,2.0,-,-9.0,2,2.0,,1.0,1.0,1.0,1.0,1.0,1.0,1.0,0.0,0.0,0.0,1.0,1.0,1.0,0.0,0.0,0.0,4.0,0.0,1.0,1.0,0.0,5.0,0.0,0.0,0.0,0.0,0.0,-1.0,-1.0,-1.0,-1.0,-1.0,0.0,0.0,0.0,3.0,29.0,21.0,4.0,20.0,-5.0,24.0,6.0,1.0,1.0,10.0,7.0,23.0,1.0,3.0,14.0,2.0,1.0,1.0,58.0,4.0,2.0,2.0,1.0,0.0,1.0,5.0,0.0,0.0,4.0,0.0,1.0,1.0,0.0,0.0,0.0,0.0,0.0,0.0,1.0,1.0
5.0,5063.0,1969.0,1.0,2.0,2.0,0.0,1.0,2.0,3.0,14.0,9.0,1.0,1.0,1.0,2.0,2.0,1.0,1.0,1.0,1.0,1.0,1.0,1.0,0.0,0.0,0.0,0.0,0.0,0.0,0.0,0.0,0.0,0.0,0.0,0.0,0.0,0.0,0.0,0.0,0.0,0.0,0.0,0.0,0.0,0.0,0.0,0.0,无,,,,,,0.0,0.0,0.0,0.0,0.0,0.0,0.0,0.0,0.0,0.0,0.0,0.0,1.0,1.0,1.0,1.0,1.0,1.0,1.0,1.0,1.0,1.0,1.0,1.0,1.0,1.0,1.0,9.0,4.0,4.0,1.0,1.0,1.0,5.0,1.0,1.0,0.0,0.0,0.0,0.0,0.0,0.0,0.0,0.0,,,,,,,,,,,,0,3.0,3.0,3.0,3.0,2.0,2.0,2.0,2.0,2.0,2.0,2.0,2.0,2.0,2.0,1.0,1.0,1.0,1.0,1.0,1.0,1.0,1.0,1.0,8.0,8.0,8.0,8.0,2.0,2.0,2.0,2.0,2.0,2.0,2.0,2.0,2.0,2.0,3.0,3.0,2.0,5.0,1.0,1.0,1.0,1.0,2.0,2.0,2,2.0,2,2.0,2,2.0,2,2.0,2,2.0,-,-9.0,2,2.0,,0.0,0.0,0.0,0.0,0.0,0.0,0.0,0.0,0.0,0.0,0.0,0.0,0.0,0.0,0.0,0.0,2.0,0.0,0.0,0.0,0.0,5.0,0.0,0.0,0.0,0.0,0.0,0.0,0.0,0.0,0.0,0.0,0.0,0.0,0.0,0.0,9.0,7.0,8.0,32.0,0.0,0.0,0.0,0.0,0.0,0.0,0.0,8.0,0.0,1.0,6.0,0.0,0.0,0.0,51.0,4.0,2.0,1.0,1.0,0.0,1.0,5.0,0.0,0.0,2.0,0.0,0.0,0.0,0.0,0.0,0.0,0.0,0.0,0.0,0.0,0.0
1.0,1.0,1973.0,1.0,2.0,1.0,2.0,3.0,2.0,3.0,14.0,4.0,1.0,1.0,1.0,1.0,2.0,1.0,1.0,1.0,1.0,1.0,4.0,1.0,2.0,1.0,1.0,0.0,1.0,0.0,1.0,0.0,1.0,0.0,1.0,1.0,1.0,0.0,0.0,0.0,0.0,0.0,0.0,1.0,0.0,1.0,1.0,2.0,体重明显减少10kg,胸部颗粒状,大拇指的手指甲；表面有塌陷,皮脂白色,嗓子嘶哑,口干舌燥,5.0,5.0,5.0,1.0,0.0,0.0,1.0,0.0,1.0,0.0,0.0,0.0,,,,,,,,1.0,1.0,1.0,1.0,1.0,1.0,1.0,1.0,2.0,5.0,5.0,1.0,1.0,1.0,1.0,1.0,1.0,2.0,1.0,3.0,3.0,2.0,0.0,0.0,3.0,1.0,,,,,,,,,,,1,2.0,2.0,2.0,2.0,2.0,2.0,2.0,2.0,2.0,2.0,2.0,2.0,1.0,1.0,4.0,4.0,1.0,1.0,1.0,1.0,1.0,1.0,1.0,10.0,6.0,6.0,8.0,2.0,2.0,2.0,2.0,2.0,3.0,2.0,2.0,1.0,1.0,5.0,3.0,4.0,4.0,1.0,4.0,2.0,4.0,2.0,2.0,-,-9.0,-,,-,,-,,-,,-,-9.0,-,,,0.42,0.32,0.32,0.3,0.34,0.47,0.21,0.0,0.0,0.0,0.0,0.0,0.0,0.0,1.0,1.0,5.0,0.0,0.0,0.0,0.0,5.0,0.0,0.0,0.0,0.0,0.0,0.0,0.0,0.0,1.0,0.0,0.0,-1.0,0.0,2.0,15.0,10.0,10.0,30.0,1.0,15.0,15.0,0.0,0.0,3.0,2.38,8.0,14.0,5.0,10.0,0.0,0.0,0.0,47.0,3.0,2.0,2.0,1.0,0.0,1.0,1.0,1.0,0.0,5.0,0.0,0.0,0.0,0.0,0.0,1.0,0.0,0.0,0.0,3.0,1.0
5.0,5060.0,1952.0,1.0,2.0,1.0,1.0,3.0,2.0,3.0,14.0,9.0,1.0,1.0,1.0,2.0,2.0,2.0,2.0,2.0,2.0,2.0,2.0,2.0,0.0,0.0,0.0,0.0,0.0,0.0,0.0,0.0,0.0,0.0,0.0,0.0,0.0,2.0,0.0,0.0,0.0,0.0,0.0,0.0,2.0,2.0,0.0,0.0,三高,鼻涕多,尿酸高,,,,8.0,8.0,8.0,0.0,0.0,3.0,0.0,0.0,0.0,0.0,0.0,0.0,1.0,1.0,1.0,1.0,1.0,1.0,1.0,4.0,1.0,2.0,2.0,1.0,1.0,1.0,1.0,3.0,3.0,3.0,1.0,1.0,1.0,3.0,1.0,1.0,2.0,0.0,1.0,1.0,1.0,0.0,0.0,0.0,1.0,,,,,,,,,,,1、12：三高、尿酸高、前列腺疾病,1.0,1.0,2.0,2.0,2.0,2.0,2.0,2.0,2.0,2.0,2.0,2.0,2.0,2.0,3.0,2.0,2.0,2.0,2.0,3.0,1.0,1.0,3.0,8.0,8.0,8.0,8.0,1.0,1.0,1.0,2.0,1.0,2.0,2.0,2.0,2.0,2.0,2.0,3.0,4.0,5.0,2.0,5.0,3.0,3.0,1.0,1.0,,-9.0,1,1.0,1,1.0,1,1.0,1：血糖高,1.0,-,-9.0,2,2.0,,0.0,0.0,0.0,0.0,0.0,0.0,0.0,0.0,0.0,0.0,0.0,0.0,0.0,0.0,0.0,0.0,5.0,1.0,1.0,1.0,1.0,5.0,0.0,0.0,0.0,-1.0,-1.0,-1.0,0.0,-1.0,0.0,0.0,0.0,0.0,0.0,0.0,19.0,14.0,6.0,32.0,-4.0,24.0,6.0,1.0,1.0,3.0,0.0,13.0,5.0,3.0,8.0,2.0,0.0,0.0,68.0,5.0,2.0,2.0,1.0,0.0,1.0,5.0,0.0,0.0,5.0,1.0,1.0,1.0,1.0,0.0,1.0,0.0,0.0,0.0,1.0,1.0
5.0,5061.0,1987.0,1.0,2.0,1.0,1.0,5.0,2.0,3.0,14.0,4.0,1.0,1.0,1.0,2.0,2.0,1.0,1.0,1.0,1.0,1.0,1.0,1.0,0.0,0.0,0.0,0.0,0.0,0.0,0.0,0.0,0.0,0.0,0.0,0.0,0.0,0.0,0.0,0.0,0.0,0.0,0.0,0.0,0.0,0.0,0.0,0.0,无,,,,,,0.0,0.0,0.0,0.0,0.0,0.0,0.0,0.0,0.0,0.0,0.0,0.0,1.0,1.0,1.0,1.0,1.0,1.0,1.0,1.0,1.0,1.0,1.0,1.0,1.0,1.0,1.0,8.0,4.0,4.0,1.0,1.0,1.0,5.0,1.0,1.0,0.0,0.0,0.0,0.0,0.0,0.0,0.0,0.0,,,,,,,,,,,,12：血糖高,1.0,2.0,2.0,2.0,2.0,2.0,2.0,2.0,2.0,2.0,2.0,2.0,2.0,2.0,1.0,1.0,1.0,1.0,1.0,1.0,1.0,1.0,1.0,9.0,9.0,9.0,9.0,2.0,2.0,2.0,2.0,2.0,2.0,2.0,2.0,2.0,2.0,4.0,3.0,2.0,5.0,1.0,2.0,1.0,1.0,2.0,2.0,2,2.0,2,2.0,2,2.0,2,2.0,2,2.0,-,-9.0,2,2.0,,0.0,0.0,0.0,0.0,0.0,0.0,0.0,0.0,0.0,0.0,0.0,0.0,0.0,0.0,0.0,0.0,2.0,0.0,0.0,0.0,0.0,5.0,0.0,0.0,0.0,0.0,0.0,0.0,0.0,0.0,0.0,0.0,0.0,0.0,0.0,0.0,9.0,7.0,8.0,36.0,0.0,0.0,0.0,1.0,0.0,0.0,0.0,8.0,0.0,1.0,6.0,1.0,0.0,0.0,33.0,2.0,2.0,3.0,1.0,0.0,1.0,1.0,0.0,0.0,2.0,0.0,0.0,0.0,0.0,0.0,1.0,0.0,0.0,0.0,0.0,1.0
3.0,2011.0,2000.0,2.0,1.0,2.0,0.0,2.0,2.0,3.0,14.0,5.0,1.0,1.0,1.0,2.0,2.0,1.0,1.0,1.0,1.0,1.0,3.0,1.0,0.0,0.0,0.0,0.0,0.0,0.0,0.0,0.0,0.0,0.0,0.0,0.0,0.0,0.0,0.0,0.0,0.0,0.0,0.0,0.0,0.0,0.0,0.0,0.0,无,,,,,,0.0,0.0,0.0,0.0,0.0,0.0,0.0,0.0,0.0,0.0,0.0,0.0,1.0,1.0,1.0,1.0,1.0,1.0,1.0,1.0,1.0,1.0,1.0,1.0,1.0,1.0,1.0,9.0,5.0,5.0,1.0,1.0,1.0,5.0,1.0,1.0,0.0,0.0,1.0,0.0,0.0,0.0,0.0,0.0,,,,,1.0,,,,,,,5,2.0,2.0,2.0,2.0,2.0,2.0,2.0,2.0,2.0,2.0,1.0,1.0,1.0,1.0,3.0,1.0,1.0,1.0,1.0,1.0,1.0,1.0,1.0,10.0,10.0,10.0,6.0,2.0,2.0,2.0,2.0,2.0,2.0,2.0,2.0,1.0,1.0,4.0,4.0,4.0,4.0,1.0,5.0,1.0,3.0,1.0,1.0,2,2.0,-,,2,2.0,2,2.0,2,2.0,-,-9.0,2,2.0,,0.0,0.0,0.0,0.0,0.0,0.0,0.0,0.0,0.0,0.0,0.0,0.0,1.0,1.0,1.0,1.0,2.0,0.0,0.0,0.0,0.0,5.0,0.0,0.0,0.0,0.0,0.0,0.0,0.0,0.0,0.0,0.0,0.0,0.0,0.0,4.0,11.0,9.0,10.0,36.0,0.0,0.0,0.0,0.0,0.0,0.0,0.0,8.0,1.0,1.0,6.0,0.0,0.0,0.0,20.0,1.0,1.0,1.0,1.0,0.0,1.0,3.0,0.0,0.0,2.0,0.0,0.0,0.0,0.0,0.0,1.0,0.0,0.0,0.0,0.0,0.0
3.0,2016.0,1984.0,2.0,2.0,1.0,1.0,5.0,2.0,3.0,14.0,6.0,1.0,1.0,1.0,1.0,2.0,1.64,1.99,1.82,1.96,2.15,2.13,2.1,0.0,1.0,1.0,1.0,0.0,0.0,2.0,0.0,0.0,0.0,1.0,1.0,2.0,1.0,0.0,0.0,0.0,0.0,2.0,2.0,0.0,0.0,1.0,2.0,无,,,,,,7.0,7.0,6.0,3.0,3.0,1.0,3.0,0.0,3.0,3.0,3.0,0.0,4.0,4.0,1.0,4.0,4.0,4.0,4.0,5.0,5.0,1.0,5.0,4.0,4.0,5.0,2.0,6.0,2.0,4.0,5.0,5.0,4.0,4.0,4.0,4.0,2.0,0.0,2.0,0.0,2.0,0.0,0.0,1.0,,,,,,,,1.0,,,,8.12(脂肪肝）,1.0,2.0,1.0,1.0,1.0,2.0,2.0,2.0,2.0,1.0,1.0,1.0,2.0,3.0,4.0,3.0,4.0,4.0,4.0,4.0,4.0,4.0,4.0,5.0,5.0,5.0,2.0,1.0,1.0,1.0,1.0,1.0,2.0,2.0,1.0,5.0,1.0,1.0,5.0,5.0,5.0,1.0,5.0,1.0,2.0,1.0,1.0,-,-9.0,-,,-,,-,,-,,-,-9.0,-,,,3.0,3.0,0.0,3.0,3.0,3.0,3.0,0.0,0.0,0.0,0.0,1.0,1.0,1.0,0.0,0.0,5.0,0.0,0.0,0.0,0.0,5.0,0.0,1.0,1.0,-1.0,-1.0,-1.0,-1.0,-1.0,0.0,0.0,-1.0,-1.0,0.0,3.0,35.0,13.790000000000001,6.0,17.0,-6.0,20.0,17.0,1.0,0.0,19.0,18.0,31.0,7.0,2.0,24.0,1.0,1.0,1.0,36.0,2.0,2.0,3.0,1.0,0.0,1.0,2.0,1.0,0.0,5.0,0.0,0.0,0.0,0.0,0.0,1.0,1.0,1.0,1.0,3.0,1.0
1.0,30.0,1990.0,2.0,2.0,1.0,1.0,4.0,1.0,3.0,14.0,6.0,1.0,1.0,1.0,1.0,2.0,1.0,1.0,1.0,1.0,1.0,2.0,3.0,0.0,0.0,0.0,0.0,0.0,0.0,0.0,0.0,0.0,0.0,0.0,0.0,0.0,0.0,0.0,0.0,0.0,1.0,0.0,0.0,0.0,0.0,0.0,0.0,无,,,,,,0.0,0.0,1.0,0.0,0.0,2.0,0.0,0.0,0.0,0.0,0.0,0.0,1.0,1.0,1.0,1.0,2.0,1.0,1.0,1.0,1.0,1.0,1.0,1.0,1.0,1.0,1.0,2.0,4.0,4.0,1.0,1.0,1.0,1.0,1.0,1.0,0.0,0.0,0.0,0.0,0.0,0.0,0.0,0.0,,,,,,,,,,,,0,1.0,2.0,2.0,2.0,2.0,2.0,2.0,2.0,2.0,2.0,2.0,1.0,2.0,2.0,1.0,3.0,1.0,2.0,3.0,1.0,1.0,1.0,3.0,10.0,10.0,10.0,8.0,2.0,2.0,2.0,2.0,1.0,2.0,2.0,2.0,3.0,2.0,3.0,3.0,3.0,5.0,3.0,5.0,4.0,2.0,2.0,2.0,2,2.0,2,2.0,2,2.0,2,2.0,2,2.0,入院日期:2020-02-21 12:26  出院日期:2020-2-29  住院天数: 8天,8.0,2,2.0,,0.0,0.0,0.0,0.0,1.0,0.0,0.0,0.0,0.0,0.0,0.0,0.0,0.0,1.0,0.0,0.0,2.0,0.0,0.0,0.0,0.0,1.0,0.0,0.0,0.0,0.0,0.0,0.0,0.0,-1.0,0.0,0.0,0.0,-1.0,0.0,1.0,16.0,10.0,8.0,38.0,-1.0,1.0,1.0,1.0,0.0,2.0,1.0,8.0,0.0,5.0,10.0,1.0,0.0,0.0,30.0,1.0,2.0,3.0,1.0,0.0,1.0,2.0,1.0,0.0,2.0,0.0,0.0,0.0,0.0,0.0,0.0,0.0,0.0,0.0,0.0,1.0
3.0,2030.0,2000.0,1.0,1.0,2.0,0.0,5.0,2.0,3.0,14.0,5.0,1.0,1.0,1.0,2.0,2.0,2.0,2.0,2.0,2.0,1.0,1.0,1.0,0.0,0.0,0.0,0.0,0.0,0.0,1.0,0.0,0.0,0.0,0.0,0.0,0.0,0.0,0.0,0.0,0.0,0.0,0.0,0.0,0.0,0.0,0.0,0.0,无,,,,,,0.0,0.0,0.0,0.0,0.0,0.0,0.0,2.0,0.0,0.0,0.0,0.0,1.0,1.0,1.0,1.0,1.0,1.0,1.0,1.0,2.0,1.0,1.0,1.0,1.0,1.0,1.0,5.0,5.0,3.0,3.0,3.0,4.0,2.0,3.0,3.0,1.0,1.0,2.0,1.0,0.0,2.0,0.0,0.0,,,,,,,,,,,,0,2.0,2.0,2.0,2.0,1.0,2.0,2.0,2.0,2.0,2.0,2.0,2.0,2.0,2.0,2.0,2.0,2.0,2.0,1.0,2.0,3.0,2.0,1.0,10.0,10.0,8.0,8.0,2.0,2.0,2.0,2.0,2.0,2.0,2.0,2.0,1.0,2.0,2.0,3.0,1.0,4.0,1.0,1.0,2.0,2.0,2.0,2.0,2,2.0,2,2.0,2,2.0,2,2.0,2,2.0,2020.01.30-2020.02.12；13,13.0,2,2.0,,0.0,0.0,0.0,0.0,0.0,0.0,0.0,0.0,0.0,0.0,0.0,0.0,0.0,0.0,0.0,0.0,2.0,0.0,0.0,0.0,0.0,1.0,0.0,0.0,0.0,0.0,0.0,0.0,0.0,0.0,0.0,0.0,0.0,0.0,0.0,0.0,17.0,11.0,8.0,36.0,0.0,0.0,1.0,0.0,0.0,2.0,0.0,9.0,7.0,4.0,20.0,0.0,0.0,0.0,20.0,1.0,1.0,3.0,1.0,0.0,1.0,3.0,0.0,0.0,2.0,0.0,0.0,0.0,0.0,0.0,0.0,1.0,0.0,0.0,0.0,0.0
4.0,12.0,1952.0,2.0,2.0,1.0,2.0,1.0,1.0,3.0,14.0,2.0,1.0,1.0,1.0,2.0,2.0,3.0,3.0,3.0,3.0,3.0,3.0,3.0,0.0,1.0,1.0,0.0,0.0,0.0,0.0,0.0,0.0,0.0,0.0,0.0,0.0,0.0,0.0,0.0,0.0,0.0,0.0,0.0,0.0,0.0,1.0,0.0,无,,,,,,0.0,0.0,0.0,1.0,1.0,3.0,1.0,0.0,1.0,1.0,1.0,1.0,1.0,1.0,1.0,1.0,1.0,1.0,1.0,1.0,1.0,1.0,1.0,1.0,1.0,1.0,1.0,2.0,4.0,4.0,4.0,4.0,4.0,4.0,3.0,3.0,2.0,2.0,2.0,2.0,2.0,2.0,0.0,0.0,,,,,,,,,,,,0,2.0,2.0,1.0,2.0,2.0,2.0,2.0,2.0,2.0,2.0,2.0,1.0,2.0,1.0,3.0,3.0,3.0,3.0,3.0,3.0,3.0,3.0,3.0,5.0,5.0,2.0,2.0,2.0,2.0,2.0,2.0,2.0,2.0,2.0,2.0,3.0,3.0,4.0,3.0,3.0,3.0,5.0,5.0,5.0,1.0,1.0,1.0,2,2.0,2,2.0,2,2.0,2,2.0,2,2.0,13,13.0,2,2.0,,0.0,0.0,0.0,0.0,0.0,0.0,0.0,0.0,0.0,0.0,0.0,0.0,0.0,1.0,0.0,1.0,2.0,0.0,0.0,0.0,0.0,1.0,0.0,1.0,0.0,0.0,0.0,0.0,0.0,0.0,0.0,0.0,0.0,0.0,0.0,2.0,27.0,21.0,8.0,14.0,0.0,0.0,3.0,0.0,0.0,10.0,0.0,8.0,12.0,2.0,20.0,0.0,1.0,0.0,68.0,5.0,2.0,1.0,1.0,0.0,1.0,1.0,0.0,0.0,2.0,0.0,0.0,0.0,0.0,0.0,0.0,0.0,0.0,1.0,0.0,1.0
5.0,5031.0,1964.0,2.0,2.0,1.0,3.0,1.0,1.0,2.0,14.0,8.0,1.0,1.0,1.0,2.0,2.0,1.0,2.0,1.0,1.0,2.0,1.0,3.0,0.0,1.0,1.0,1.0,1.0,0.0,1.0,0.0,1.0,0.0,0.0,1.0,1.0,0.0,0.0,0.0,0.0,0.0,0.0,1.0,1.0,0.0,0.0,0.0,有 暴躁易怒 3-4次/周,,,,,,6.0,5.0,5.0,2.0,1.0,0.0,1.0,1.0,0.0,0.0,1.0,0.0,4.0,1.0,2.0,1.0,2.0,3.0,2.0,1.0,2.0,1.0,1.0,2.0,1.0,1.0,2.0,8.0,4.0,5.0,2.0,3.0,2.0,4.0,2.0,2.0,2.0,1.0,1.0,1.0,2.0,1.0,2.0,1.0,,,,,,,,,,,,0,1.0,1.0,3.0,3.0,2.0,2.0,2.0,2.0,2.0,2.0,2.0,2.0,2.0,1.0,2.0,2.0,2.0,2.0,2.0,2.0,2.0,2.0,3.0,7.0,8.0,6.0,5.0,2.0,2.0,2.0,1.0,2.0,2.0,2.0,2.0,2.0,2.0,3.0,4.0,5.0,4.0,1.0,1.0,1.0,2.0,1.0,1.0,2,2.0,2,2.0,2,2.0,2,2.0,2,2.0,13,13.0,2,2.0,,3.0,0.0,1.0,0.0,1.0,2.0,1.0,0.0,0.0,0.0,0.0,0.0,0.0,0.0,0.0,1.0,2.0,0.0,0.0,0.0,0.0,1.0,0.0,0.0,0.0,0.0,0.0,0.0,-1.0,0.0,0.0,0.0,0.0,0.0,0.0,1.0,19.0,11.0,9.0,26.0,-1.0,16.0,10.0,1.0,1.0,6.0,8.0,11.0,11.0,2.0,13.0,2.0,1.0,1.0,56.0,4.0,2.0,1.0,1.0,0.0,1.0,4.0,0.0,0.0,2.0,0.0,0.0,0.0,0.0,0.0,0.0,0.0,0.0,0.0,2.0,1.0
2.0,16.0,2000.0,2.0,1.0,2.0,0.0,5.0,2.0,3.0,14.0,5.0,1.0,1.0,1.0,2.0,2.0,1.0,3.0,2.0,4.0,4.0,1.0,3.0,0.0,0.0,0.0,0.0,0.0,1.0,1.0,1.0,1.0,0.0,1.0,1.0,1.0,0.0,0.0,0.0,0.0,0.0,0.0,1.0,0.0,0.0,1.0,0.0,无,,,,,,0.0,0.0,0.0,0.0,0.0,0.0,0.0,0.0,0.0,1.0,0.0,0.0,1.0,1.0,1.0,1.0,1.0,1.0,1.0,1.0,1.0,1.0,1.0,1.0,1.0,1.0,1.0,6.0,4.0,4.0,1.0,1.0,1.0,4.0,1.0,1.0,1.0,3.0,1.0,1.0,0.0,1.0,1.0,1.0,,,,,,,,,,,,0,2.0,2.0,2.0,2.0,2.0,2.0,2.0,2.0,2.0,2.0,2.0,1.0,2.0,2.0,1.0,3.0,1.0,1.0,1.0,1.0,1.0,1.0,1.0,7.0,10.0,9.0,3.0,1.0,2.0,2.0,2.0,2.0,2.0,2.0,2.0,1.0,1.0,5.0,4.0,3.0,5.0,2.0,3.0,2.0,3.0,2.0,2.0,3,3.0,2,2.0,2,2.0,2,2.0,2,2.0,14,14.0,2,2.0,,0.0,0.0,0.0,0.0,0.0,0.0,0.0,0.0,0.0,0.0,0.0,0.0,0.0,1.0,0.0,0.0,3.0,0.0,0.0,0.0,0.0,1.0,0.0,0.0,0.0,-1.0,0.0,0.0,0.0,0.0,0.0,0.0,0.0,0.0,0.0,1.0,11.0,18.0,8.0,29.0,-1.0,0.0,9.0,0.0,0.0,1.0,0.0,8.0,9.0,2.0,7.0,0.0,0.0,0.0,20.0,1.0,1.0,3.0,1.0,0.0,1.0,3.0,0.0,0.0,3.0,0.0,0.0,0.0,0.0,0.0,0.0,0.0,0.0,0.0,1.0,0.0
2.0,32.0,1969.0,2.0,2.0,1.0,1.0,3.0,2.0,1.0,14.0,8.0,1.0,1.0,1.0,2.0,2.0,2.0,2.0,2.0,2.0,2.0,2.0,2.0,0.0,0.0,0.0,0.0,1.0,0.0,0.0,0.0,0.0,0.0,0.0,0.0,0.0,2.0,0.0,0.0,0.0,0.0,0.0,1.0,0.0,0.0,0.0,0.0,无,,,,,,5.0,9.0,8.0,1.0,2.0,2.0,1.0,0.0,0.0,0.0,1.0,0.0,2.0,3.0,2.0,2.0,2.0,2.0,2.0,2.0,1.0,2.0,1.0,2.0,3.0,4.0,3.0,5.0,3.0,3.0,3.0,3.0,3.0,3.0,2.0,3.0,1.0,1.0,1.0,1.0,1.0,1.0,1.0,1.0,,,,,,,,,,,,0,1.0,1.0,1.0,2.0,2.0,1.0,1.0,1.0,2.0,2.0,1.0,1.0,2.0,2.0,3.0,3.0,2.0,3.0,3.0,2.0,3.0,3.0,2.0,5.0,3.0,2.0,1.0,2.0,2.0,2.0,1.0,1.0,2.0,1.0,1.0,1.0,1.0,5.0,1.0,3.0,5.0,3.0,5.0,3.0,2.0,1.0,2.0,3,3.0,2,2.0,2,2.0,2,2.0,2,2.0,15,15.0,2,2.0,,1.0,2.0,1.0,1.0,1.0,1.0,1.0,1.0,1.0,1.0,0.0,0.0,1.0,1.0,0.0,0.0,3.0,0.0,0.0,0.0,0.0,2.0,0.0,1.0,0.0,0.0,0.0,0.0,-1.0,-1.0,0.0,-1.0,-1.0,0.0,0.0,5.0,24.0,14.0,6.0,11.0,-4.0,22.0,4.0,1.0,1.0,7.0,8.0,18.0,8.0,3.0,17.0,2.0,1.0,1.0,51.0,4.0,2.0,2.0,1.0,1.0,1.0,4.0,0.0,0.0,3.0,0.0,0.0,0.0,0.0,0.0,0.0,0.0,0.0,1.0,0.0,1.0
4.0,60.0,1989.0,2.0,2.0,1.0,1.0,4.0,1.0,3.0,14.0,6.0,1.0,1.0,1.0,1.0,2.0,1.0,1.0,1.0,1.0,1.0,1.0,1.0,0.0,0.0,0.0,0.0,0.0,0.0,0.0,0.0,0.0,0.0,0.0,0.0,0.0,0.0,0.0,0.0,0.0,0.0,0.0,0.0,0.0,0.0,0.0,0.0,无,,,,,,6.0,2.0,6.0,0.0,0.0,0.0,0.0,0.0,0.0,0.0,0.0,0.0,1.0,1.0,1.0,1.0,1.0,1.0,1.0,2.0,1.0,1.0,2.0,1.0,1.0,1.0,1.0,8.0,4.0,4.0,3.0,3.0,3.0,4.0,2.0,2.0,1.0,1.0,2.0,2.0,2.0,1.0,0.0,0.0,,,,,,,,,,,,0,2.0,2.0,2.0,2.0,2.0,2.0,2.0,2.0,2.0,2.0,1.0,2.0,2.0,2.0,3.0,3.0,2.0,2.0,2.0,2.0,2.0,2.0,2.0,10.0,7.0,10.0,7.0,2.0,2.0,2.0,2.0,2.0,3.0,3.0,2.0,1.0,1.0,4.0,3.0,2.0,4.0,1.0,1.0,1.0,3.0,1.0,1.0,3,3.0,2,2.0,2,2.0,2,2.0,2,2.0,15,15.0,2,2.0,,0.0,0.0,0.0,0.0,0.0,0.0,0.0,0.0,0.0,0.0,0.0,0.0,1.0,0.0,0.0,0.0,3.0,0.0,0.0,0.0,0.0,2.0,0.0,0.0,0.0,0.0,0.0,0.0,0.0,0.0,1.0,1.0,0.0,-1.0,0.0,1.0,20.0,7.0,8.0,34.0,2.0,14.0,0.0,0.0,0.0,0.0,0.0,10.0,9.0,2.0,15.0,0.0,0.0,0.0,31.0,2.0,2.0,3.0,1.0,0.0,1.0,2.0,1.0,0.0,3.0,0.0,0.0,0.0,0.0,0.0,0.0,0.0,0.0,0.0,0.0,1.0